[Clfs-support] grub compile problem

Mykal Funk mykalfunk at gmail.com
Thu Dec 24 20:13:18 PST 2009

On 12/24/2009 9:44 AM, Mykal Funk wrote:
> Configure completed without error when I issed the make command I got 
> this:
> asmstub.c: In function 'grub_stage2':
> asmstub.c:160: error: 'MAP_32BIT' undeclared (first use in this function)
> asmstub.c:160: error: (Each undeclared identifier is reported only once
> asmstub.c:160: error: for each function it appears in.)
> make[2]: *** [asmstub.o] Error 1
> make[2]: Leaving directory `/work/grub-0.97/grub'
> make[1]: *** [all-recursive] Error 1
> make[1]: Leaving directory `/work/grub-0.97'
> make: *** [all] Error 2
> The only thing I found on google was a thread in Chinese that google 
> translated for me. Didn't make much sense. I am using a 
> mostly-by-the-book approach, deviating to add in something from BLFS 
> here and there. I applyed all four of the patches. Any help will be 
> appreciated.
> Thanks in advance,
> Mykal Funk
I found an answer. I found updated patches at 
http://svn.cross-lfs.org/svn/repos/patches/grub/ that fixed the compile 

Mykal Funk

More information about the Clfs-support mailing list